build failure in WinXP with JDK 1.6.0_03

classic Classic list List threaded Threaded
7 messages Options
Reply | Threaded
Open this post in threaded view
|

build failure in WinXP with JDK 1.6.0_03

Shing Wai Chan
Hi,
I have checkout a brand new workspace and build in WinXP with JDK 1.6.0_03.
It has failure in running one of the test:
Tests in error:
  testHttpsProtocolProcess(com.sun.grizzly.http.HttpRedirectorTest)

Any idea?
Thanks.
      Shing Wai Chan

---------------------------------------------------------------------
To unsubscribe, e-mail: [hidden email]
For additional commands, e-mail: [hidden email]

Reply | Threaded
Open this post in threaded view
|

RE: build failure in WinXP with JDK 1.6.0_03

John C. Turnbull
I was getting this exact same error but I found that it goes away if you
build each module individually so I don't think it's anything to worry
about.  Apparently it's a known issue but is difficult to reproduce
consistently.

-JCT

> -----Original Message-----
> From: [hidden email] [mailto:[hidden email]]
> Sent: Saturday, 5 January 2008 05:26
> To: [hidden email]
> Subject: build failure in WinXP with JDK 1.6.0_03
>
> Hi,
> I have checkout a brand new workspace and build in WinXP with JDK
> 1.6.0_03.
> It has failure in running one of the test:
> Tests in error:
>   testHttpsProtocolProcess(com.sun.grizzly.http.HttpRedirectorTest)
>
> Any idea?
> Thanks.
>       Shing Wai Chan
>
> ---------------------------------------------------------------------
> To unsubscribe, e-mail: [hidden email]
> For additional commands, e-mail: [hidden email]

---------------------------------------------------------------------
To unsubscribe, e-mail: [hidden email]
For additional commands, e-mail: [hidden email]

Reply | Threaded
Open this post in threaded view
|

Re: build failure in WinXP with JDK 1.6.0_03

Oleksiy Stashok
In reply to this post by Shing Wai Chan
Hi,

can you pls. send the stacktrace?

Thank you.

WBR,
Alexey.

Shing Wai Chan wrote:

> Hi,
> I have checkout a brand new workspace and build in WinXP with JDK
> 1.6.0_03.
> It has failure in running one of the test:
> Tests in error:
>  testHttpsProtocolProcess(com.sun.grizzly.http.HttpRedirectorTest)
>
> Any idea?
> Thanks.
>      Shing Wai Chan
>
> ---------------------------------------------------------------------
> To unsubscribe, e-mail: [hidden email]
> For additional commands, e-mail: [hidden email]
>

---------------------------------------------------------------------
To unsubscribe, e-mail: [hidden email]
For additional commands, e-mail: [hidden email]

Reply | Threaded
Open this post in threaded view
|

Re: build failure in WinXP with JDK 1.6.0_03

Shing Wai Chan
Oleksiy Stashok wrote:
> Hi,
>
> can you pls. send the stacktrace?
There is no stack trace. I have cut and paste all the errors.
But I remember I have seen this before. It has been gone. Now, it is back.

>
> Thank you.
>
> WBR,
> Alexey.
>
> Shing Wai Chan wrote:
>> Hi,
>> I have checkout a brand new workspace and build in WinXP with JDK
>> 1.6.0_03.
>> It has failure in running one of the test:
>> Tests in error:
>>  testHttpsProtocolProcess(com.sun.grizzly.http.HttpRedirectorTest)
>>
>> Any idea?
>> Thanks.
>>      Shing Wai Chan
>>
>> ---------------------------------------------------------------------
>> To unsubscribe, e-mail: [hidden email]
>> For additional commands, e-mail: [hidden email]
>>
>
> ---------------------------------------------------------------------
> To unsubscribe, e-mail: [hidden email]
> For additional commands, e-mail: [hidden email]
>

---------------------------------------------------------------------
To unsubscribe, e-mail: [hidden email]
For additional commands, e-mail: [hidden email]

Reply | Threaded
Open this post in threaded view
|

Re: build failure in WinXP with JDK 1.6.0_03

Shing Wai Chan
Hi Alexsy,

I have just checkout twice a brand new workspace in Solaris x86.
The first time, it failed with the same error. The second time, it passed.

Jan 8, 2008 11:14:13 AM com.sun.grizzly.http.HttpRedirectorTest setUp
INFO: SSL certs path:
/export/grizzly/srcA/grizzly/trunk/modules/http/target/test-classes/ssltest-cacerts.jks
Jan 8, 2008 11:14:13 AM com.sun.grizzly.http.HttpRedirectorTest setUp
INFO: SSL keystore path:
/export/grizzly/srcA/grizzly/trunk/modules/http/target/test-classes/ssltest-keystore.jks
Jan 8, 2008 11:14:13 AM com.sun.grizzly.http.SelectorThread
displayConfiguration
INFO:
 Grizzly configuration for port 18889
         maxThreads: 20
         minThreads: 5
         ByteBuffer size: 8192
         useDirectByteBuffer: false
         useByteBufferView: false
         maxHttpHeaderSize: 8192
         maxKeepAliveRequests: 256
         keepAliveTimeoutInSeconds: 30
         Static File Cache enabled: true
         Stream Algorithm :
com.sun.grizzly.http.utils.EmptyHttpsStreamAlgorithm
         Pipeline : com.sun.grizzly.http.LinkedListPipeline
         Round Robin Selector Algorithm enabled: true
         Round Robin Selector pool size: 2
         recycleTasks: true
         Asynchronous Request Processing enabled: false
Tests run: 4, Failures: 0, Errors: 1, Skipped: 0, Time elapsed: 16.879
sec <<< FAILURE!

Results :

Tests in error:
  testHttpsProtocolProcess(com.sun.grizzly.http.HttpRedirectorTest)

Tests run: 8, Failures: 0, Errors: 1, Skipped: 0

[INFO]
------------------------------------------------------------------------
[ERROR] BUILD FAILURE
[INFO]
------------------------------------------------------------------------
[INFO] There are test failures.
[INFO]
------------------------------------------------------------------------
[INFO] For more information, run Maven with the -e switch
[INFO]
------------------------------------------------------------------------
[INFO] Total time: 3 minutes 40 seconds
[INFO] Finished at: Tue Jan 08 11:14:18 PST 2008
[INFO] Final Memory: 27M/133M
[INFO]
------------------------------------------------------------------------


Regards,
       Shing Wai Chan

Shing Wai Chan wrote:

> Oleksiy Stashok wrote:
>
>> Hi,
>>
>> can you pls. send the stacktrace?
>
> There is no stack trace. I have cut and paste all the errors.
> But I remember I have seen this before. It has been gone. Now, it is
> back.
>
>>
>> Thank you.
>>
>> WBR,
>> Alexey.
>>
>> Shing Wai Chan wrote:
>>
>>> Hi,
>>> I have checkout a brand new workspace and build in WinXP with JDK
>>> 1.6.0_03.
>>> It has failure in running one of the test:
>>> Tests in error:
>>>  testHttpsProtocolProcess(com.sun.grizzly.http.HttpRedirectorTest)
>>>
>>> Any idea?
>>> Thanks.
>>>      Shing Wai Chan
>>>
>>> ---------------------------------------------------------------------
>>> To unsubscribe, e-mail: [hidden email]
>>> For additional commands, e-mail: [hidden email]
>>>
>>
>> ---------------------------------------------------------------------
>> To unsubscribe, e-mail: [hidden email]
>> For additional commands, e-mail: [hidden email]
>>
>
> ---------------------------------------------------------------------
> To unsubscribe, e-mail: [hidden email]
> For additional commands, e-mail: [hidden email]
>

---------------------------------------------------------------------
To unsubscribe, e-mail: [hidden email]
For additional commands, e-mail: [hidden email]

Reply | Threaded
Open this post in threaded view
|

Re: build failure in WinXP with JDK 1.6.0_03

Oleksiy Stashok
Hello Shing Wai Chan,

can you pls. check unit test logs, there should be some error
description, stacktrace.

Thank you.

WBR,
Alexey.

[hidden email] wrote:

> Hi Alexsy,
>
> I have just checkout twice a brand new workspace in Solaris x86.
> The first time, it failed with the same error. The second time, it
> passed.
>
> Jan 8, 2008 11:14:13 AM com.sun.grizzly.http.HttpRedirectorTest setUp
> INFO: SSL certs path:
> /export/grizzly/srcA/grizzly/trunk/modules/http/target/test-classes/ssltest-cacerts.jks
>
> Jan 8, 2008 11:14:13 AM com.sun.grizzly.http.HttpRedirectorTest setUp
> INFO: SSL keystore path:
> /export/grizzly/srcA/grizzly/trunk/modules/http/target/test-classes/ssltest-keystore.jks
>
> Jan 8, 2008 11:14:13 AM com.sun.grizzly.http.SelectorThread
> displayConfiguration
> INFO:
> Grizzly configuration for port 18889
>         maxThreads: 20
>         minThreads: 5
>         ByteBuffer size: 8192
>         useDirectByteBuffer: false
>         useByteBufferView: false
>         maxHttpHeaderSize: 8192
>         maxKeepAliveRequests: 256
>         keepAliveTimeoutInSeconds: 30
>         Static File Cache enabled: true
>         Stream Algorithm :
> com.sun.grizzly.http.utils.EmptyHttpsStreamAlgorithm
>         Pipeline : com.sun.grizzly.http.LinkedListPipeline
>         Round Robin Selector Algorithm enabled: true
>         Round Robin Selector pool size: 2
>         recycleTasks: true
>         Asynchronous Request Processing enabled: false
> Tests run: 4, Failures: 0, Errors: 1, Skipped: 0, Time elapsed: 16.879
> sec <<< FAILURE!
>
> Results :
>
> Tests in error:
>  testHttpsProtocolProcess(com.sun.grizzly.http.HttpRedirectorTest)
>
> Tests run: 8, Failures: 0, Errors: 1, Skipped: 0
>
> [INFO]
> ------------------------------------------------------------------------
> [ERROR] BUILD FAILURE
> [INFO]
> ------------------------------------------------------------------------
> [INFO] There are test failures.
> [INFO]
> ------------------------------------------------------------------------
> [INFO] For more information, run Maven with the -e switch
> [INFO]
> ------------------------------------------------------------------------
> [INFO] Total time: 3 minutes 40 seconds
> [INFO] Finished at: Tue Jan 08 11:14:18 PST 2008
> [INFO] Final Memory: 27M/133M
> [INFO]
> ------------------------------------------------------------------------
>
>
> Regards,
>       Shing Wai Chan
>
> Shing Wai Chan wrote:
>
>> Oleksiy Stashok wrote:
>>
>>> Hi,
>>>
>>> can you pls. send the stacktrace?
>>
>> There is no stack trace. I have cut and paste all the errors.
>> But I remember I have seen this before. It has been gone. Now, it is
>> back.
>>
>>>
>>> Thank you.
>>>
>>> WBR,
>>> Alexey.
>>>
>>> Shing Wai Chan wrote:
>>>
>>>> Hi,
>>>> I have checkout a brand new workspace and build in WinXP with JDK
>>>> 1.6.0_03.
>>>> It has failure in running one of the test:
>>>> Tests in error:
>>>>  testHttpsProtocolProcess(com.sun.grizzly.http.HttpRedirectorTest)
>>>>
>>>> Any idea?
>>>> Thanks.
>>>>      Shing Wai Chan
>>>>
>>>> ---------------------------------------------------------------------
>>>> To unsubscribe, e-mail: [hidden email]
>>>> For additional commands, e-mail: [hidden email]
>>>>
>>>
>>> ---------------------------------------------------------------------
>>> To unsubscribe, e-mail: [hidden email]
>>> For additional commands, e-mail: [hidden email]
>>>
>>
>> ---------------------------------------------------------------------
>> To unsubscribe, e-mail: [hidden email]
>> For additional commands, e-mail: [hidden email]
>>
>
> ---------------------------------------------------------------------
> To unsubscribe, e-mail: [hidden email]
> For additional commands, e-mail: [hidden email]
>

---------------------------------------------------------------------
To unsubscribe, e-mail: [hidden email]
For additional commands, e-mail: [hidden email]

Reply | Threaded
Open this post in threaded view
|

Re: build failure in WinXP with JDK 1.6.0_03

Shing Wai Chan
The following is from log:

Tests run: 4, Failures: 0, Errors: 1, Skipped: 0, Time elapsed: 16.879
sec <<< FAILURE!
testHttpsProtocolProcess(com.sun.grizzly.http.HttpRedirectorTest)  Time
elapsed: 5.642 sec  <<< ERROR!
javax.net.ssl.SSLHandshakeException: Remote host closed connection
during handshake
        at
com.sun.net.ssl.internal.ssl.SSLSocketImpl.readRecord(SSLSocketImpl.java:741)
        at
com.sun.net.ssl.internal.ssl.SSLSocketImpl.performInitialHandshake(SSLSocketImpl.java:1029)
        at
com.sun.net.ssl.internal.ssl.SSLSocketImpl.startHandshake(SSLSocketImpl.java:1056)
        at
com.sun.net.ssl.internal.ssl.SSLSocketImpl.startHandshake(SSLSocketImpl.java:1040)
        at
sun.net.www.protocol.https.HttpsClient.afterConnect(HttpsClient.java:405)
        at
sun.net.www.protocol.https.AbstractDelegateHttpsURLConnection.connect(AbstractDelegateHttpsURLConnection.java:170)
        at
sun.net.www.protocol.http.HttpURLConnection.getOutputStream(HttpURLConnection.java:836)
        at
sun.net.www.protocol.https.HttpsURLConnectionImpl.getOutputStream(HttpsURLConnectionImpl.java:230)
        at
com.sun.grizzly.http.HttpRedirectorTest.testHttpsProtocolProcess(HttpRedirectorTest.java:257)
Caused by: java.io.EOFException: SSL peer shut down incorrectly
        at
com.sun.net.ssl.internal.ssl.InputRecord.read(InputRecord.java:333)
        at
com.sun.net.ssl.internal.ssl.SSLSocketImpl.readRecord(SSLSocketImpl.java:722)
        ... 34 more



---------------------------------------------------------------------
To unsubscribe, e-mail: [hidden email]
For additional commands, e-mail: [hidden email]